BDBM50576232 CHEMBL4867313
SMILES Cc1cc(NNC(=O)Nc2cc(Cl)nc(Cl)c2)ncc1-c1cnn(C)c1
InChI Key InChIKey=WXWNPQSQCBBZMR-UHFFFAOYSA-N
Data  4 IC50
  Tab Delimited (TSV)   2D SDfile   Computed 3D by Vconf -m prep SDfile
Find this compound or compounds like it in BindingDB:
Activity Spreadsheet -- Enzyme Inhibition Constant Data from BindingDB
Found 4 hits for monomerid = 50576232
TargetSphingosine 1-phosphate receptor 2(Homo sapiens (Human))
Galapagos
Curated by ChEMBL
LigandPNGBDBM50576232(CHEMBL4867313)
Affinity DataIC50: >2.30E+4nM. Assay description: Agonist activity at human S1P2 receptor expressed in CHO cells assessed as calcium flux measured for 3 mins by fluorescence assay
Ligand InfoPC cidPC sid
In DepthDetails ArticlePubMed
TargetSphingosine 1-phosphate receptor 2(Homo sapiens (Human))
Galapagos
Curated by ChEMBL
LigandPNGBDBM50576232(CHEMBL4867313)
Affinity DataIC50:  1.20E+3nM. Assay description: Displacement of radio labeled-SIP from human recombinant S1P2 receptor expressed in CHO cell membranes measured after 15 mins by radioligand based co...
Ligand InfoPC cidPC sid
In DepthDetails ArticlePubMed
TargetSphingosine 1-phosphate receptor 2(Homo sapiens (Human))
Galapagos
Curated by ChEMBL
LigandPNGBDBM50576232(CHEMBL4867313)
Affinity DataIC50:  3.40nM. Assay description: Antagonist activity at recombinant human S1P2 receptor expressed in human CHO cells assessed as EC80 S1P-induced activation incubated for 4 hrs in pr...
Ligand InfoPC cidPC sid
In DepthDetails ArticlePubMed
TargetSphingosine 1-phosphate receptor 2(Homo sapiens (Human))
Galapagos
Curated by ChEMBL
LigandPNGBDBM50576232(CHEMBL4867313)
Affinity DataIC50:  2.60E+3nM. Assay description: Antagonist activity at human S1P2 receptor expressed in CHO cells assessed as EC80 S1P-induced calcium flux measured for 3 mins by fluorescence assay
Ligand InfoPC cidPC sid
In DepthDetails ArticlePubMed