BDBM50578692 CHEMBL4877950
SMILES COc1ccc(CNC(=O)C(=O)[C@@H]2CCCN2C(=O)CNC(=O)c2ccnc3ccccc23)cc1OC
InChI Key InChIKey=QYNUSKJDVJHHFJ-NRFANRHFSA-N
Data  2 IC50
  Tab Delimited (TSV)   2D SDfile   Computed 3D by Vconf -m prep SDfile
Find this compound or compounds like it in BindingDB:
Activity Spreadsheet -- Enzyme Inhibition Constant Data from BindingDB
Found 2 hits for monomerid = 50578692
TargetDipeptidyl peptidase 4(Homo sapiens (Human))
The Czech Academy Of Sciences
Curated by ChEMBL
LigandPNGBDBM50578692(CHEMBL4877950)
Affinity DataIC50: >4.00E+3nM. Assay description: Inhibition of SF-tagged DPP4 (unknown origin) expressed in Drosophila S2 cells using fluorogenic substrate by spectrometric analysis
Ligand InfoPC cidPC sid
In DepthDetails ArticlePubMed
TargetAcyl-protein thioesterase 1(Rattus norvegicus)
The Czech Academy Of Sciences
Curated by ChEMBL
LigandPNGBDBM50578692(CHEMBL4877950)
Affinity DataIC50:  0.0890nM. Assay description: Inhibition of SF-tagged FAP (unknown origin) expressed in Drosophila S2 cells using fluorogenic substrate by spectrometric analysis
Ligand InfoPC cidPC sid
In DepthDetails ArticlePubMed