BDBM50578700 CHEMBL4847764
SMILES O=C(CNC(=O)c1ccnc2ccccc12)N1CCC[C@H]1C(=O)C(=O)NC1CC1
InChI Key InChIKey=UWWNVTQYDDYRFC-KRWDZBQOSA-N
Data  1 IC50
  Tab Delimited (TSV)   2D SDfile   Computed 3D by Vconf -m prep SDfile
Find this compound or compounds like it in BindingDB:
Activity Spreadsheet -- Enzyme Inhibition Constant Data from BindingDB
Found 1 hit for monomerid = 50578700
TargetAcyl-protein thioesterase 1(Rattus norvegicus)
The Czech Academy Of Sciences
Curated by ChEMBL
LigandPNGBDBM50578700(CHEMBL4847764)
Affinity DataIC50:  0.640nM. Assay description: Inhibition of SF-tagged FAP (unknown origin) expressed in Drosophila S2 cells using fluorogenic substrate by spectrometric analysis
Ligand InfoPC cidPC sid
In DepthDetails ArticlePubMed