BDBM50580156 CHEMBL5076109
SMILES [Na;v0+].[Na;v0+].[#6]-[#6]-[#6]-[#6]-[#6]-[#6]-[#6]-[#6]-[#6]-[#6]-[#6]-[#6](=O)-[#7]-[#6@H]-1-[#6@@H](-[#8]P([#8-])([#8-])=O)-[#8]-[#6@H](-[#6]-[#8])-[#6@@H](-[#8]-[#6](=O)-[#6]-[#6]-[#6]-[#6]-[#6]-[#6]-[#6]-[#6]-[#6]-[#6]-[#6])-[#6@@H]-1-[#8]-[#6](=O)-[#6]-[#6]-[#6]-[#6]-[#6]-[#6]-[#6]-[#6]-[#6]-[#6]-[#6]
InChI Key InChIKey=FIZILAFFYNWNJL-YOQSVJHZSA-L
Data  1 Kd
  Tab Delimited (TSV)   2D SDfile   Computed 3D by Vconf -m prep SDfile
Find this compound or compounds like it in BindingDB:
Activity Spreadsheet -- Enzyme Inhibition Constant Data from BindingDB
Found 1 hit for monomerid = 50580156
TargetToll-like receptor 4/MD-2(Homo sapiens (Human))
University Of Milano-Bicocca
Curated by ChEMBL
LigandPNGBDBM50580156(CHEMBL5076109)
Affinity DataKd:  570nM. Assay description: Binding affinity to NTA sensor chip immobilized recombinant human TLR4/MD2 assessed as dissociation constant by surface plasmon resonance analysis
Ligand InfoPC cidPC sid
In DepthDetails ArticlePubMed