BDBM50581021 CHEMBL5076899
SMILES NC(=O)c1cccc(OCc2cccc(Cl)c2)c1
InChI Key InChIKey=OAXJYKCTIPZAMR-UHFFFAOYSA-N
Data  1 Kd
  Tab Delimited (TSV)   2D SDfile   Computed 3D by Vconf -m prep SDfile
Find this compound or compounds like it in BindingDB:
Activity Spreadsheet -- Enzyme Inhibition Constant Data from BindingDB
Found 1 hit for monomerid = 50581021
TargetCell division protein FtsZ(Bacillus subtilis)
Csic
Curated by ChEMBL
LigandPNGBDBM50581021(CHEMBL5076899)
Affinity DataKd:  9.30E+3nM. Assay description: Binding affinity to Bacillus subtilis FtsZ polymer assessed as dissociation constant by fluorescence anisotropy analysis
Ligand InfoPC cidPC sid
In DepthDetails ArticlePubMed