BDBM50581035 CHEMBL5089927
SMILES CCC[C@@H](COc1ccc(F)c(C(N)=O)c1F)Nc1cccc(c1)C(F)(F)F
InChI Key InChIKey=ZDQMKFRLFDWUNG-ZDUSSCGKSA-N
Data  1 Kd
  Tab Delimited (TSV)   2D SDfile   Computed 3D by Vconf -m prep SDfile
Find this compound or compounds like it in BindingDB:
Activity Spreadsheet -- Enzyme Inhibition Constant Data from BindingDB
Found 1 hit for monomerid = 50581035
TargetCell division protein FtsZ(Bacillus subtilis)
Csic
Curated by ChEMBL
LigandPNGBDBM50581035(CHEMBL5089927)
Affinity DataKd:  3.80E+3nM. Assay description: Binding affinity to Bacillus subtilis FtsZ polymer assessed as dissociation constant by fluorescence anisotropy analysis
Ligand InfoPC cidPC sid
In DepthDetails ArticlePubMed