BDBM50581144 CHEMBL5087050
SMILES CNC(=O)[C@H]1Cc2ccc(NC(=O)C(Cc3cc(ccc3Cl)-c3cccc(CCC(=O)N1)c3)NC(=O)c1ccnn1C)cc2
InChI Key InChIKey=CEFRORFLEYHRHI-QXPUDEPPSA-N
Data  1 IC50  1 Kd
  Tab Delimited (TSV)   2D SDfile   Computed 3D by Vconf -m prep SDfile
Find this compound or compounds like it in BindingDB:
Activity Spreadsheet -- Enzyme Inhibition Constant Data from BindingDB
Found 2 hits for monomerid = 50581144
TargetInterleukin-17A(Homo sapiens (Human))
Fidelta
Curated by ChEMBL
LigandPNGBDBM50581144(CHEMBL5087050)
Affinity DataIC50:  9nM. Assay description: Inhibition of IL-17A (unknown origin) measured by FRET assay
Ligand InfoPC cidPC sid
In DepthDetails ArticlePubMed
TargetInterleukin-17A(Homo sapiens (Human))
Fidelta
Curated by ChEMBL
LigandPNGBDBM50581144(CHEMBL5087050)
Affinity DataKd: <141nM. Assay description: Binding affinity to IL-17A (unknown origin) measured by SPR assay
Ligand InfoPC cidPC sid
In DepthDetails ArticlePubMed