BDBM50581145 CHEMBL5079201
SMILES CC(C)C[C@H](NC(=O)[C@@H](N)CC(O)=O)C(=O)N[C@@H](CO)C(=O)N[C@@H](C)C(=O)N[C@@H](C(C)C)C(=O)N[C@@H](CS)C(=O)N[C@@H](Cc1c[nH]c2ccccc12)C(=O)N[C@@H](C)C(=O)N[C@@H](Cc1ccccc1)C(=O)N1CCC[C@H]1C(=O)N[C@@H](Cc1c[nH]c2ccccc12)C(=O)N[C@@H](CC(O)=O)C(=O)N1CCC[C@H]1C(=O)N[C@@H](CCC(O)=O)C(=O)N[C@@H](CS)C(O)=O
InChI Key InChIKey=LQSAOIBKJLLICU-RZMQOCHXSA-N
Data  1 IC50  1 Kd
  Tab Delimited (TSV)   2D SDfile   Computed 3D by Vconf -m prep SDfile
Find this compound or compounds like it in BindingDB:
Activity Spreadsheet -- Enzyme Inhibition Constant Data from BindingDB
Found 2 hits for monomerid = 50581145
TargetInterleukin-17A(Homo sapiens (Human))
Fidelta
Curated by ChEMBL
LigandPNGBDBM50581145(CHEMBL5079201)
Affinity DataIC50:  160nM. Assay description: Inhibition of IL-17A (unknown origin) measured by AlphaLISA assay
Ligand InfoPC cidPC sid
In DepthDetails ArticlePubMed
TargetInterleukin-17A(Homo sapiens (Human))
Fidelta
Curated by ChEMBL
LigandPNGBDBM50581145(CHEMBL5079201)
Affinity DataKd:  30nM. Assay description: Binding affinity to IL-17A (unknown origin) measured by SPR assay
Ligand InfoPC cidPC sid
In DepthDetails ArticlePubMed