BDBM50581365 CHEMBL5072701
SMILES OC[C@H](Cc1ccccc1O)NC(=O)[C@H](Cc1ccccc1)NCC(=O)OCc1ccccc1
InChI Key InChIKey=CSSGTEMXBCAZSV-ZEQRLZLVSA-N
Data  1 KI
  Tab Delimited (TSV)   2D SDfile   Computed 3D by Vconf -m prep SDfile
Find this compound or compounds like it in BindingDB:
Activity Spreadsheet -- Enzyme Inhibition Constant Data from BindingDB
Found 1 hit for monomerid = 50581365
TargetCruzipain(Trypanosoma cruzi)
Texas A&M University
Curated by ChEMBL
LigandPNGBDBM50581365(CHEMBL5072701)
Affinity DataKi: >1.00E+4nM. Assay description: Time dependent inhibition of Trypanosoma cruzi cruzain using Cbz-Phe-Arg-AMC as substrate assessed as inhibition constant for EI complex measured for...
Ligand InfoPC cidPC sid
In DepthDetails ArticlePubMed