BDBM50581367 CHEMBL5079029
SMILES COc1ccc2OC(O)[C@H](Cc2c1)NC(=O)[C@H](Cc1ccccc1)NC(=O)OCc1ccccc1
InChI Key InChIKey=TUFKVTZZRHCRHD-XAWUTYGVSA-N
Data  1 KI
  Tab Delimited (TSV)   2D SDfile   Computed 3D by Vconf -m prep SDfile
Find this compound or compounds like it in BindingDB:
Activity Spreadsheet -- Enzyme Inhibition Constant Data from BindingDB
Found 1 hit for monomerid = 50581367
TargetCruzipain(Trypanosoma cruzi)
Texas A&M University
Curated by ChEMBL
LigandPNGBDBM50581367(CHEMBL5079029)
Affinity DataKi:  350nM. Assay description: Time dependent inhibition of Trypanosoma cruzi cruzain using Cbz-Phe-Arg-AMC as substrate assessed as inhibition constant for EI complex measured for...
Ligand InfoPC cidPC sid
In DepthDetails ArticlePubMed