BDBM50584000 CHEMBL4877117
SMILES Cn1cc(cn1)-n1cnc2c(NCc3nc4cc(Cl)c(Cl)cc4[nH]3)nc(nc12)N1CCOCC1
InChI Key InChIKey=FSELUFUYNUNZKD-UHFFFAOYSA-N
Data  1 IC50  5 Kd
PDB links: 2 PDB IDs match this monomer.
  Tab Delimited (TSV)   2D SDfile   Computed 3D by Vconf -m prep SDfile
Find this compound or compounds like it in BindingDB:
Activity Spreadsheet -- Enzyme Inhibition Constant Data from BindingDB
Found 6 hits for monomerid = 50584000
TargetCyclin-dependent kinase 12(Homo sapiens)
Zhejiang University
Curated by ChEMBL
LigandPNGBDBM50584000(CHEMBL4877117)
Affinity DataIC50:  469nM. Assay description: Inhibition of human CDK12 (696 to 1082 residues) /cyclinK (1 to 300 residues) using ac-YSPTSPpSYSPTSFpS-YSPTSPpSY-[PEG2]-RR-amid peptide as substrate...
TargetCyclin-dependent kinase 12(Homo sapiens)
Zhejiang University
Curated by ChEMBL
LigandPNGBDBM50584000(CHEMBL4877117)
Affinity DataKd:  98nM. Assay description: Binding affinity to CDK12 (unknown origin) assessed as dissociation constant
TargetGlycogen synthase kinase-3 beta(Homo sapiens (Human))
Hefei University Of Technology
Curated by ChEMBL
LigandPNGBDBM50584000(CHEMBL4877117)
Affinity DataKd:  810nM. Assay description: Binding affinity to full-length human wild-type GSK-3-beta expressed in mammalian expression system assessed as dissociation constant by DiscoverX KI...
In DepthDetails PubMed
TargetCyclin-dependent kinase 12(Homo sapiens)
Zhejiang University
Curated by ChEMBL
LigandPNGBDBM50584000(CHEMBL4877117)
Affinity DataKd:  98nM. Assay description: Binding affinity to partial length human wild-type CDK12 expressed in mammalian expression system assessed as dissociation constant by DiscoverX KINO...
TargetCyclin-dependent kinase 13(Homo sapiens (Human))
Hefei University Of Technology
Curated by ChEMBL
LigandPNGBDBM50584000(CHEMBL4877117)
Affinity DataKd:  4.90nM. Assay description: Binding affinity to partial length human wild-type CDK13 expressed in mammalian expression system assessed as dissociation constant by DiscoverX KINO...
TargetCyclin-dependent kinase 13(Homo sapiens (Human))
Hefei University Of Technology
Curated by ChEMBL
LigandPNGBDBM50584000(CHEMBL4877117)
Affinity DataKd:  4.90nM. Assay description: Binding affinity to CDK13 (unknown origin) assessed as dissociation constant