BDBM50587669 CHEMBL5190521
SMILES CN1c2cc3ccccc3cc2C(=O)N(C)c2cnc(Nc3cnn(c3)C3CCNCC3)nc12
InChI Key InChIKey=MFWHDFGMXHATNR-UHFFFAOYSA-N
Data  4 IC50
  Tab Delimited (TSV)   2D SDfile   Computed 3D by Vconf -m prep SDfile
Find this compound or compounds like it in BindingDB:
Activity Spreadsheet -- Enzyme Inhibition Constant Data from BindingDB
Found 4 hits for monomerid = 50587669
TargetNUAK family SNF1-like kinase 1(Homo sapiens (Human))
University Of Science And Technology (Ust)
Curated by ChEMBL
LigandPNGBDBM50587669(CHEMBL5190521)
Affinity DataIC50:  30nM. Assay description: Inhibition of N-terminal GST-tagged wild type human NUAK1 expressed in Escherichia coli DH5alpha incubated for 30 mins in presence of gamma-[32P]ATP ...
Ligand InfoPC cidPC sid
In DepthDetails PubMed
TargetAurora kinase B(Homo sapiens (Human))
University Of Science And Technology (Ust)
Curated by ChEMBL
LigandPNGBDBM50587669(CHEMBL5190521)
Affinity DataIC50:  54nM. Assay description: Inhibition of Aurora B (unknown origin)
Ligand InfoPC cidPC sid
In DepthDetails PubMed
TargetAurora kinase C(Homo sapiens (Human))
University Of Science And Technology (Ust)
Curated by ChEMBL
LigandPNGBDBM50587669(CHEMBL5190521)
Affinity DataIC50:  120nM. Assay description: Inhibition of Aurora C (unknown origin)
Ligand InfoPC cidPC sid
In DepthDetails PubMed
TargetNUAK family SNF1-like kinase 1(Homo sapiens (Human))
University Of Science And Technology (Ust)
Curated by ChEMBL
LigandPNGBDBM50587669(CHEMBL5190521)
Affinity DataIC50:  1.00E+4nM. Assay description: Inhibition of NUAK1 in HEK293 cells assessed as effect on MYPT1 phosphorylation at Ser445 incubated for 3 mins by immunoblotting analysis
Ligand InfoPC cidPC sid
In DepthDetails PubMed