BDBM50587677 CHEMBL5173501
SMILES C[C@H]1CNC(=O)c2cnn3cc(N[C@H](C)c4cc(F)cc(O1)c4)cnc23
InChI Key InChIKey=SBLCPBDVMUSESZ-WDEREUQCSA-N
Data  4 IC50
  Tab Delimited (TSV)   2D SDfile   Computed 3D by Vconf -m prep SDfile
Find this compound or compounds like it in BindingDB:
Activity Spreadsheet -- Enzyme Inhibition Constant Data from BindingDB
Found 4 hits for monomerid = 50587677
TargetNUAK family SNF1-like kinase 1(Homo sapiens (Human))
University Of Science And Technology (Ust)
Curated by ChEMBL
LigandPNGBDBM50587677(CHEMBL5173501)
Affinity DataIC50:  3.70nM. Assay description: Inhibition of N-terminal GST-tagged wild type human NUAK1 expressed in Escherichia coli DH5alpha incubated for 30 mins in presence of gamma-[32P]ATP ...
Ligand InfoPC cidPC sid
In DepthDetails PubMed
TargetALK tyrosine kinase receptor(Homo sapiens (Human))
University Of Science And Technology (Ust)
Curated by ChEMBL
LigandPNGBDBM50587677(CHEMBL5173501)
Affinity DataIC50:  1nM. Assay description: Inhibition of wild type ALK (unknown origin)
Ligand InfoPC cidPC sid
In DepthDetails PubMed
TargetALK tyrosine kinase receptor(Homo sapiens (Human))
University Of Science And Technology (Ust)
Curated by ChEMBL
LigandPNGBDBM50587677(CHEMBL5173501)
Affinity DataIC50:  1.30nM. Assay description: Inhibition of ALK G1202R mutant (unknown origin)
Ligand InfoPC cidPC sid
In DepthDetails PubMed
TargetALK tyrosine kinase receptor(Homo sapiens (Human))
University Of Science And Technology (Ust)
Curated by ChEMBL
LigandPNGBDBM50587677(CHEMBL5173501)
Affinity DataIC50:  1.10nM. Assay description: Inhibition of ALK L1196M mutant (unknown origin)
Ligand InfoPC cidPC sid
In DepthDetails PubMed