BDBM50587682 CHEMBL5204647
SMILES CCS(=O)(=O)c1ccc(cc1)-c1cc(C(=O)NC2CCN(C)CC2)c(C)c2[nH]c3ncc(C)cc3c12
InChI Key InChIKey=LVTJOOUVDDUTJP-UHFFFAOYSA-N
Data  1 IC50
  Tab Delimited (TSV)   2D SDfile   Computed 3D by Vconf -m prep SDfile
Find this compound or compounds like it in BindingDB:
Activity Spreadsheet -- Enzyme Inhibition Constant Data from BindingDB
Found 1 hit for monomerid = 50587682
TargetNUAK family SNF1-like kinase 1(Homo sapiens (Human))
University Of Science And Technology (Ust)
Curated by ChEMBL
LigandPNGBDBM50587682(CHEMBL5204647)
Affinity DataIC50:  9.10nM. Assay description: Inhibition of NUAK1 (unknown origin)
Ligand InfoPC cidPC sid
In DepthDetails PubMed