BDBM50587908 CHEMBL5193790
SMILES COc1ccc2cc(ccc2c1)C(C)C(=O)O\N=C(/N)c1ccc(OC)c(OC)c1
InChI Key InChIKey=PWTWRQYQTOUEAK-UHFFFAOYSA-N
Data  1 IC50
  Tab Delimited (TSV)   2D SDfile   Computed 3D by Vconf -m prep SDfile
Find this compound or compounds like it in BindingDB:
Activity Spreadsheet -- Enzyme Inhibition Constant Data from BindingDB
Found 1 hit for monomerid = 50587908
TargetCytochrome c oxidase subunit 2(Ovis aries)
Dpsr University
Curated by ChEMBL
LigandPNGBDBM50587908(CHEMBL5193790)
Affinity DataIC50:  6.40nM. Assay description: Inhibition of ovine COX-2 colorimetric enzyme immunoassay
Ligand InfoPC cidPC sid
In DepthDetails PubMed