BDBM50587911 CHEMBL5183049
SMILES COc1ccc(cc1)-c1cc(-c2nnc(SC\C(=N\O)C(=C)\C=C/C)n2-c2ccccc2)c2ccccc2n1
InChI Key InChIKey=NAGGUQTYDIRZGO-OZPDOQDOSA-N
Data  1 KI
  Tab Delimited (TSV)   2D SDfile   Computed 3D by Vconf -m prep SDfile
Find this compound or compounds like it in BindingDB:
Activity Spreadsheet -- Enzyme Inhibition Constant Data from BindingDB
Found 1 hit for monomerid = 50587911
TargetCytochrome c oxidase subunit 2(Homo sapiens (Human))
Dpsr University
Curated by ChEMBL
LigandPNGBDBM50587911(CHEMBL5183049)
Affinity DataKi:  9.46E+4nM. Assay description: Binding affinity to human recombinant COX-2 assessed as inhibition constant preincubated for 5 mins followed by arachidonic acid addition measured ev...
Ligand InfoPC cidPC sid
In DepthDetails PubMed