BDBM50588166 CHEMBL5081118
SMILES CC1=C(C(N=C(Nc2nc3ccc(F)cc3o2)N1)c1ccc(cc1Cl)-c1ccc(C)nc1)C(=O)Nc1cc(ccn1)C(O)=O
InChI Key InChIKey=DWFLWZLSCXJHEM-UHFFFAOYSA-N
Data  2 IC50
  Tab Delimited (TSV)   2D SDfile   Computed 3D by Vconf -m prep SDfile
Find this compound or compounds like it in BindingDB:
Activity Spreadsheet -- Enzyme Inhibition Constant Data from BindingDB
Found 2 hits for monomerid = 50588166
TargetGalactokinase(Homo sapiens (Human))
National Center For Advancing Translational Sciences
Curated by ChEMBL
LigandPNGBDBM50588166(CHEMBL5081118)
Affinity DataIC50:  347nM. Assay description: Inhibition of recombinant human GALK1 using galactose as substrate incubated for 1 hrs in the presence of ATP by Kinase-Glo reagent based luminescenc...
Ligand InfoPC cidPC sid
In DepthDetails PubMed
TargetGalactokinase(Homo sapiens (Human))
National Center For Advancing Translational Sciences
Curated by ChEMBL
LigandPNGBDBM50588166(CHEMBL5081118)
Affinity DataIC50:  340nM. Assay description: Inhibition of recombinant human GALK1 using galactose as substrate incubated for 1 hrs in the presence of ATP by Kinase-Glo reagent based luminescenc...
Ligand InfoPC cidPC sid
In DepthDetails PubMed