BDBM50588168 CHEMBL5075869
SMILES CC1=C([C@@H](N=C(Nc2nc3cccc(N)c3o2)N1)c1ccc(C)cc1Cl)C(=O)NCc1cnn(C)c1
InChI Key InChIKey=KTJLSJPIOOTQQU-NRFANRHFSA-N
Data  3 IC50
  Tab Delimited (TSV)   2D SDfile   Computed 3D by Vconf -m prep SDfile
Find this compound or compounds like it in BindingDB:
Activity Spreadsheet -- Enzyme Inhibition Constant Data from BindingDB
Found 3 hits for monomerid = 50588168
TargetGalactokinase(Homo sapiens (Human))
National Center For Advancing Translational Sciences
Curated by ChEMBL
LigandPNGBDBM50588168(CHEMBL5075869)
Affinity DataIC50:  130nM. Assay description: Inhibition of recombinant human GALK1 using galactose as substrate incubated for 1 hrs in the presence of ATP by Kinase-Glo reagent based luminescenc...
Ligand InfoPC cidPC sid
In DepthDetails PubMed
TargetGalactokinase(Mus musculus)
National Center For Advancing Translational Sciences
Curated by ChEMBL
LigandPNGBDBM50588168(CHEMBL5075869)
Affinity DataIC50:  1.58E+3nM. Assay description: Inhibition of mouse GALK1
Ligand InfoPC cidPC sid
In DepthDetails PubMed
TargetGalactokinase(Homo sapiens (Human))
National Center For Advancing Translational Sciences
Curated by ChEMBL
LigandPNGBDBM50588168(CHEMBL5075869)
Affinity DataIC50:  120nM. Assay description: Inhibition of recombinant human GALK1 using galactose as substrate incubated for 1 hrs in the presence of ATP by Kinase-Glo reagent based luminescenc...
Ligand InfoPC cidPC sid
In DepthDetails PubMed