BDBM50589998 CHEMBL5185763
SMILES O=C(N1CCC(CC1)N1CCCCC1)c1ccc(Nc2nccc(n2)-c2cc3ccccc3s2)cc1
InChI Key InChIKey=ISPSRVFVQHUHDF-UHFFFAOYSA-N
Data  1 IC50
  Tab Delimited (TSV)   2D SDfile   Computed 3D by Vconf -m prep SDfile
Find this compound or compounds like it in BindingDB:
Activity Spreadsheet -- Enzyme Inhibition Constant Data from BindingDB
Found 1 hit for monomerid = 50589998
TargetGlycogen synthase kinase 3(Plasmodium falciparum (isolate 3D7))
University Of North Carolina At Chapel Hill
Curated by ChEMBL
LigandPNGBDBM50589998(CHEMBL5185763)
Affinity DataIC50:  695nM. Assay description: Inhibition of Plasmodium falciparum GSK3 measured after 2 hrs by luciferin-based luminescence assay
Ligand InfoPC cidPC sid
In DepthDetails ArticlePubMed