BDBM50590005 CHEMBL5203707
SMILES O=C(NC1CC1)c1ccc(Nc2nccc(n2)-c2cc3ccccc3s2)cc1
InChI Key InChIKey=QOPGYGXQLNJRQI-UHFFFAOYSA-N
Data  1 IC50
  Tab Delimited (TSV)   2D SDfile   Computed 3D by Vconf -m prep SDfile
Find this compound or compounds like it in BindingDB:
Activity Spreadsheet -- Enzyme Inhibition Constant Data from BindingDB
Found 1 hit for monomerid = 50590005
TargetGlycogen synthase kinase 3(Plasmodium falciparum (isolate 3D7))
University Of North Carolina At Chapel Hill
Curated by ChEMBL
LigandPNGBDBM50590005(CHEMBL5203707)
Affinity DataIC50:  272nM. Assay description: Inhibition of Plasmodium falciparum GSK3 measured after 2 hrs by luciferin-based luminescence assay
Ligand InfoPC cidPC sid
In DepthDetails ArticlePubMed