BDBM50590009 CHEMBL5172803
SMILES Clc1ccc(s1)-c1ccnc(Nc2ccc(cc2)C(=O)N2CCC(CC2)N2CCCC2)n1
InChI Key InChIKey=RUJUBLPCSJOYSF-UHFFFAOYSA-N
Data  1 IC50
  Tab Delimited (TSV)   2D SDfile   Computed 3D by Vconf -m prep SDfile
Find this compound or compounds like it in BindingDB:
Activity Spreadsheet -- Enzyme Inhibition Constant Data from BindingDB
Found 1 hit for monomerid = 50590009
TargetGlycogen synthase kinase 3(Plasmodium falciparum (isolate 3D7))
University Of North Carolina At Chapel Hill
Curated by ChEMBL
LigandPNGBDBM50590009(CHEMBL5172803)
Affinity DataIC50:  550nM. Assay description: Inhibition of Plasmodium falciparum GSK3 measured after 2 hrs by luciferin-based luminescence assay
Ligand InfoPC cidPC sid
In DepthDetails ArticlePubMed