BDBM50590012 CHEMBL5191618
SMILES Fc1cnc(Nc2ccc(cc2)C(=O)N2CCC(CC2)N2CCCC2)nc1-c1cc2ccccc2s1
InChI Key InChIKey=GBRVCSXICWTJQC-UHFFFAOYSA-N
Data  1 IC50
  Tab Delimited (TSV)   2D SDfile   Computed 3D by Vconf -m prep SDfile
Find this compound or compounds like it in BindingDB:
Activity Spreadsheet -- Enzyme Inhibition Constant Data from BindingDB
Found 1 hit for monomerid = 50590012
TargetGlycogen synthase kinase 3(Plasmodium falciparum (isolate 3D7))
University Of North Carolina At Chapel Hill
Curated by ChEMBL
LigandPNGBDBM50590012(CHEMBL5191618)
Affinity DataIC50:  456nM. Assay description: Inhibition of Plasmodium falciparum GSK3 measured after 2 hrs by luciferin-based luminescence assay
Ligand InfoPC cidPC sid
In DepthDetails ArticlePubMed