BDBM50590018 CHEMBL5186081
SMILES Clc1ccc(s1)-c1nc(Nc2ccc(cc2)C(=O)NCCCN2CCOCC2)ncc1Cl
InChI Key InChIKey=FCGZLWCVWFYUTA-UHFFFAOYSA-N
Data  1 IC50
  Tab Delimited (TSV)   2D SDfile   Computed 3D by Vconf -m prep SDfile
Find this compound or compounds like it in BindingDB:
Activity Spreadsheet -- Enzyme Inhibition Constant Data from BindingDB
Found 1 hit for monomerid = 50590018
TargetGlycogen synthase kinase 3(Plasmodium falciparum (isolate 3D7))
University Of North Carolina At Chapel Hill
Curated by ChEMBL
LigandPNGBDBM50590018(CHEMBL5186081)
Affinity DataIC50:  97nM. Assay description: Inhibition of Plasmodium falciparum GSK3 measured after 2 hrs by luciferin-based luminescence assay
In DepthDetails ArticlePubMed