BDBM50592555 CHEMBL5171524
SMILES CN1CCN(CC1)c1ccc(NC(=O)c2ccccc2Nc2cccc(Cl)c2C)cc1
InChI Key InChIKey=ZGOQDFANLUZZNB-UHFFFAOYSA-N
Data  1 IC50
  Tab Delimited (TSV)   2D SDfile   Computed 3D by Vconf -m prep SDfile
Find this compound or compounds like it in BindingDB:
Activity Spreadsheet -- Enzyme Inhibition Constant Data from BindingDB
Found 1 hit for monomerid = 50592555
TargetCytochrome c oxidase subunit 2(Homo sapiens (Human))
Lanzhou University
Curated by ChEMBL
LigandPNGBDBM50592555(CHEMBL5171524)
Affinity DataIC50:  3.16E+3nM. Assay description: Inhibition of COX-2 (unknown origin)
Ligand InfoPC cidPC sid
In DepthDetails PubMed