BDBM50594412 CHEMBL5175052
SMILES COc1ccc(NC(=O)N[C@@H](Cc2ccccc2)C(=O)N[C@@H](CCc2ccccc2)\C=C\C(C)=O)cc1
InChI Key InChIKey=AVPANLPFEQTDRV-CRMBFIAWSA-N
Data  1 KI
  Tab Delimited (TSV)   2D SDfile   Computed 3D by Vconf -m prep SDfile
Find this compound or compounds like it in BindingDB:
Activity Spreadsheet -- Enzyme Inhibition Constant Data from BindingDB
Found 1 hit for monomerid = 50594412
TargetCysteine protease(Trypanosoma brucei rhodesiense)
University Of Messina
Curated by ChEMBL
LigandPNGBDBM50594412(CHEMBL5175052)
Affinity DataKi:  1.10nM. Assay description: Binding affinity to recombinant Trypanosoma brucei rhodesiense rhodesain assessed as inhibition constant using Cbz-Phe-Arg-AMC as fluorogenic substra...
Ligand InfoPC cidPC sid
In DepthDetails PubMed