BDBM50594442 CHEMBL5178988
SMILES Cc1ccc(CSCc2nnc(SCC(=O)Nc3ccc(Br)cc3Br)n2C)cc1
InChI Key InChIKey=WMAKXXYICWYYJD-UHFFFAOYSA-N
Data  3 EC50
  Tab Delimited (TSV)   2D SDfile   Computed 3D by Vconf -m prep SDfile
Find this compound or compounds like it in BindingDB:
Activity Spreadsheet -- Enzyme Inhibition Constant Data from BindingDB
Found 3 hits for monomerid = 50594442
TargetPotassium voltage-gated channel subfamily KQT member 2(Homo sapiens (Human))
East China Normal University
Curated by ChEMBL
LigandPNGBDBM50594442(CHEMBL5178988)
Affinity DataEC50:  3.90E+3nM. Assay description: Agonist activity at human KCNQ2 expressed in CHO cells assessed as increase in outward current at 50 mV by patch clamp electrophysiology method
Ligand InfoPC cidPC sid
In DepthDetails PubMed
TargetPotassium voltage-gated channel subfamily KQT member 4(Homo sapiens (Human))
East China Normal University
Curated by ChEMBL
LigandPNGBDBM50594442(CHEMBL5178988)
Affinity DataEC50:  6.40E+3nM. Assay description: Agonist activity at human KCNQ4 channel expressed in CHO cells assessed as increase in outward current by patch clamp electrophysiology method
Ligand InfoPC cidPC sid
In DepthDetails PubMed
TargetPotassium voltage-gated channel subfamily KQT member 5(Homo sapiens (Human))
East China Normal University
Curated by ChEMBL
LigandPNGBDBM50594442(CHEMBL5178988)
Affinity DataEC50:  4.50E+3nM. Assay description: Agonist activity at human KCNQ5 channel expressed in CHO cells assessed as increase in outward current by patch clamp electrophysiology method
Ligand InfoPC cidPC sid
In DepthDetails PubMed