BDBM50594654 CHEMBL5171044
SMILES NC1=C(C#N)C(=O)n2nc(nc2C1)-c1ccccc1
InChI Key InChIKey=SCFLIUQAHUFFOG-UHFFFAOYSA-N
Data  1 KI
  Tab Delimited (TSV)   2D SDfile   Computed 3D by Vconf -m prep SDfile
Find this compound or compounds like it in BindingDB:
Activity Spreadsheet -- Enzyme Inhibition Constant Data from BindingDB
Found 1 hit for monomerid = 50594654
TargetAdenosine receptor A1(Homo sapiens (Human))
Isf College Of Pharmacy
Curated by ChEMBL
LigandPNGBDBM50594654(CHEMBL5171044)
Affinity DataKi:  0.0760nM. Assay description: Binding affinity to human adenosine A1A receptor measured by radioligand-based affinity assay
Ligand InfoPC cidPC sid
In DepthDetails PubMed