BDBM50595583 CHEMBL5189367
SMILES CCCCCCCCCCCCCCCC(=O)N[C@@H](CCC(=O)N[C@@H](CCC(=O)NCCCC[C@H](NC(=O)[C@H](CC(O)=O)NC(=O)[C@H](CO)NC(=O)[C@@H](NC(=O)[C@H](Cc1ccccc1)NC(=O)[C@@H](NC(=O)CNC(=O)[C@H](CCC(N)=O)NC(=O)C(C)(C)NC(=O)[C@@H](N)Cc1cnc[nH]1)[C@@H](C)O)[C@@H](C)O)C(=O)N[C@@H](CO)C(=O)N[C@@H](CCCCN)C(=O)N[C@@H](Cc1ccc(O)cc1)C(=O)N[C@@H](CC(C)C)C(=O)N[C@@H](CC(O)=O)C(=O)NC(C)(C)C(=O)N[C@@H](CCCNC(N)=N)C(=O)N[C@@H](CCCNC(N)=N)C(=O)N[C@@H](C)C(=O)N[C@@H](CCC(N)=O)C(=O)N[C@@H](CC(O)=O)C(=O)N[C@@H](Cc1ccccc1)C(=O)N[C@@H](C(C)C)C(=O)N[C@@H](CCC(N)=O)C(=O)N[C@@H](Cc1c[nH]c2ccccc12)C(=O)N[C@@H](CC(C)C)C(=O)N[C@@H](CC(C)C)C(=O)N[C@@H](CC(N)=O)C(=O)N[C@@H]([C@@H](C)O)C(=O)N[C@@H](CCCCNC(=O)CC[C@H](N)C(O)=O)C(N)=O)C(O)=O)C(O)=O
InChI Key InChIKey=DBJSALHBLNBJLL-DWKFSFQHSA-N
Data  2 EC50
  Tab Delimited (TSV)   2D SDfile   Computed 3D by Vconf -m prep SDfile
Find this compound or compounds like it in BindingDB:
Activity Spreadsheet -- Enzyme Inhibition Constant Data from BindingDB
Found 2 hits for monomerid = 50595583
TargetGlucagon-like peptide 1 receptor(Homo sapiens (Human))
Merck
Curated by ChEMBL
LigandPNGBDBM50595583(CHEMBL5189367)
Affinity DataEC50:  0.00500nM. Assay description: Agonist activity at human GLP1R expressed in frozen cells assessed as increase in cAMP production measured after 1 hr by HitHunter luminescence assay
Ligand InfoPC cidPC sid
In DepthDetails PubMed
TargetGlucagon receptor(Homo sapiens (Human))
Merck
Curated by ChEMBL
LigandPNGBDBM50595583(CHEMBL5189367)
Affinity DataEC50:  0.00600nM. Assay description: Agonist activity at human GCGR expressed in frozen cells assessed as increase in cAMP production measured after 1 hr by HitHunter luminescence assay
Ligand InfoPC cidPC sid
In DepthDetails PubMed