BDBM50598717 CHEMBL5193702::US20230348487, Example LS 6-45
SMILES [H][C@]12OC[C@@H](Oc3nc(Nc4ccc(N(C)CCN(C)C)c(NC(=O)C=C)c4)ncc3Cl)[C@@]1([H])OC[C@H]2OC
InChI Key InChIKey=MXXJXRACSRJBKS-OHUMZHCVSA-N
Data  13 IC50
  Tab Delimited (TSV)   2D SDfile   Computed 3D by Vconf -m prep SDfile
Find this compound or compounds like it in BindingDB:
Activity Spreadsheet -- Enzyme Inhibition Constant Data from BindingDB
Found 13 hits for monomerid = 50598717
TargetTyrosine-protein kinase JAK3(Homo sapiens (Human))
Jinan University
Curated by ChEMBL
LigandPNGBDBM50598717(CHEMBL5193702 | US20230348487, Example LS 6-45)
Affinity DataIC50:  1.20nM. Assay description: Inhibition of GST tagged recombinant human JAK3 expressed in baculovirus infection system by FRET assay
In DepthDetails PubMed
TargetNUAK family SNF1-like kinase 1(Homo sapiens (Human))
Jinan University
Curated by ChEMBL
LigandPNGBDBM50598717(CHEMBL5193702 | US20230348487, Example LS 6-45)
Affinity DataIC50:  25nM. Assay description: Inhibition of human ARK5
In DepthDetails PubMed
TargetCyclin-Y/Cyclin-dependent kinase 16(Homo sapiens (Human))
Jinan University
Curated by ChEMBL
LigandPNGBDBM50598717(CHEMBL5193702 | US20230348487, Example LS 6-45)
Affinity DataIC50:  135nM. Assay description: Inhibition of human CDK16/cyclin-Y protein-protein complex
In DepthDetails PubMed
TargetReceptor-type tyrosine-protein kinase FLT3(Homo sapiens (Human))
Jinan University
Curated by ChEMBL
LigandPNGBDBM50598717(CHEMBL5193702 | US20230348487, Example LS 6-45)
Affinity DataIC50:  132nM. Assay description: Inhibition of human FLT3
In DepthDetails PubMed
TargetTyrosine-protein kinase JAK1(Homo sapiens (Human))
Jinan University
Curated by ChEMBL
LigandPNGBDBM50598717(CHEMBL5193702 | US20230348487, Example LS 6-45)
Affinity DataIC50:  4.73E+3nM. Assay description: Inhibition of human JAK1
In DepthDetails PubMed
TargetTyrosine-protein kinase JAK2(Homo sapiens (Human))
Jinan University
Curated by ChEMBL
LigandPNGBDBM50598717(CHEMBL5193702 | US20230348487, Example LS 6-45)
Affinity DataIC50:  2.03E+3nM. Assay description: Inhibition of human JAK2
In DepthDetails PubMed
TargetTyrosine-protein kinase JAK3(Homo sapiens (Human))
Jinan University
Curated by ChEMBL
LigandPNGBDBM50598717(CHEMBL5193702 | US20230348487, Example LS 6-45)
Affinity DataIC50:  1.53nM. Assay description: Test method: Firstly, test compounds were prepared into 10 mM stock solution with DMSO, and continuously diluted into 10 concentrations at a 3-fold g...
In DepthDetails US Patent
TargetNon-receptor tyrosine-protein kinase TYK2(Homo sapiens (Human))
Jinan University
Curated by ChEMBL
LigandPNGBDBM50598717(CHEMBL5193702 | US20230348487, Example LS 6-45)
Affinity DataIC50:  365nM. Assay description: Inhibition of human TYK2
In DepthDetails PubMed
TargetTyrosine-protein kinase JAK1(Homo sapiens (Human))
Jinan University
Curated by ChEMBL
LigandPNGBDBM50598717(CHEMBL5193702 | US20230348487, Example LS 6-45)
Affinity DataIC50:  1.30E+4nM. Assay description: Test method: Firstly, test compounds were prepared into 10 mM stock solution with DMSO, and continuously diluted into 10 concentrations at a 3-fold g...
In DepthDetails US Patent
TargetTyrosine-protein kinase JAK2(Homo sapiens (Human))
Jinan University
Curated by ChEMBL
LigandPNGBDBM50598717(CHEMBL5193702 | US20230348487, Example LS 6-45)
Affinity DataIC50:  2.04E+3nM. Assay description: Test method: Firstly, test compounds were prepared into 10 mM stock solution with DMSO, and continuously diluted into 10 concentrations at a 3-fold g...
In DepthDetails US Patent
TargetTyrosine-protein kinase JAK3(Homo sapiens (Human))
Jinan University
Curated by ChEMBL
LigandPNGBDBM50598717(CHEMBL5193702 | US20230348487, Example LS 6-45)
Affinity DataIC50:  1.25nM. Assay description: Test method: Firstly, test compounds were prepared into 10 mM stock solution with DMSO, and continuously diluted into 10 concentrations at a 3-fold g...
In DepthDetails US Patent
TargetNon-receptor tyrosine-protein kinase TYK2(Homo sapiens (Human))
Jinan University
Curated by ChEMBL
LigandPNGBDBM50598717(CHEMBL5193702 | US20230348487, Example LS 6-45)
Affinity DataIC50:  1.09E+3nM. Assay description: Test method: Firstly, test compounds were prepared into 10 mM stock solution with DMSO, and continuously diluted into 10 concentrations at a 3-fold g...
In DepthDetails US Patent
TargetTyrosine-protein kinase JAK3(Homo sapiens (Human))
Jinan University
Curated by ChEMBL
LigandPNGBDBM50598717(CHEMBL5193702 | US20230348487, Example LS 6-45)
Affinity DataIC50:  8nM. Assay description: Inhibition of human JAK3
In DepthDetails PubMed