BDBM50598750 CHEMBL5193981
SMILES Cc1c(Cl)cccc1Nc1ccccc1C(=O)NCc1ccc(O)cc1
InChI Key InChIKey=ZYNQZRCXJKPMEE-UHFFFAOYSA-N
Data  1 IC50
  Tab Delimited (TSV)   2D SDfile   Computed 3D by Vconf -m prep SDfile
Find this compound or compounds like it in BindingDB:
Activity Spreadsheet -- Enzyme Inhibition Constant Data from BindingDB
Found 1 hit for monomerid = 50598750
TargetCytochrome c oxidase subunit 2(Homo sapiens (Human))
Lanzhou University
Curated by ChEMBL
LigandPNGBDBM50598750(CHEMBL5193981)
Affinity DataIC50:  490nM. Assay description: Inhibition of human COX-2 assessed as by fluorescence based microplate reader assay
Ligand InfoPC cidPC sid
In DepthDetails PubMed