BDBM50598765 CHEMBL5207189
SMILES Cc1c(Cl)cccc1Nc1ccc(F)cc1C(=O)NCc1ccc(O)c(O)c1
InChI Key InChIKey=MADVKIJUDVHXOT-UHFFFAOYSA-N
Data  2 IC50
  Tab Delimited (TSV)   2D SDfile   Computed 3D by Vconf -m prep SDfile
Find this compound or compounds like it in BindingDB:
Activity Spreadsheet -- Enzyme Inhibition Constant Data from BindingDB
Found 2 hits for monomerid = 50598765
TargetDNA topoisomerase 1(Homo sapiens (Human))
Lanzhou University
Curated by ChEMBL
LigandPNGBDBM50598765(CHEMBL5207189)
Affinity DataIC50:  4.42E+3nM. Assay description: Inhibition of human topoisomerase I assessed as DNA relaxation using DNA pBR322 as substrate incubated for 30 mins by ethidium bromide staining based...
In DepthDetails PubMed
TargetCytochrome c oxidase subunit 2(Homo sapiens (Human))
Lanzhou University
Curated by ChEMBL
LigandPNGBDBM50598765(CHEMBL5207189)
Affinity DataIC50:  240nM. Assay description: Inhibition of human COX-2 assessed as by fluorescence based microplate reader assay
In DepthDetails PubMed