BDBM50599594 CHEMBL5171272
SMILES CNC(=O)c1cc(Nc2ccccc2)cc(c1)-c1ccnc(NC(=O)C2CCOCC2)c1
InChI Key InChIKey=VBODBJMAVPEPIF-UHFFFAOYSA-N
Data  11 IC50
  Tab Delimited (TSV)   2D SDfile   Computed 3D by Vconf -m prep SDfile
Find this compound or compounds like it in BindingDB:
Activity Spreadsheet -- Enzyme Inhibition Constant Data from BindingDB
Found 11 hits for monomerid = 50599594
TargetPhosphatidylinositol 4-phosphate 5-kinase type-1 alpha(Homo sapiens (Human))
Astrazeneca
Curated by ChEMBL
LigandPNGBDBM50599594(CHEMBL5171272)
Affinity DataIC50:  95nM. Assay description: Inhibition of PIP5Kalpha (unknown origin)
Ligand InfoPC cidPC sid
In DepthDetails PubMed
TargetPhosphatidylinositol 4-phosphate 5-kinase type-1 beta(Homo sapiens)
Astrazeneca
Curated by ChEMBL
LigandPNGBDBM50599594(CHEMBL5171272)
Affinity DataIC50:  13nM. Assay description: Inhibition of PIP5Kbeta (unknown origin)
Ligand InfoPC cidPC sid
In DepthDetails PubMed
TargetPhosphatidylinositol 4-phosphate 5-kinase type-1 gamma(Homo sapiens (Human))
Astrazeneca
Curated by ChEMBL
LigandPNGBDBM50599594(CHEMBL5171272)
Affinity DataIC50:  9.5nM. Assay description: Inhibition of PIP5Kgamma (unknown origin)
Ligand InfoPC cidPC sid
In DepthDetails PubMed
LigandPNGBDBM50599594(CHEMBL5171272)
Affinity DataIC50:  3.90E+4nM. Assay description: Inhibition of PI3Kalpha (unknown origin)
Ligand InfoPC cidPC sid
In DepthDetails PubMed
LigandPNGBDBM50599594(CHEMBL5171272)
Affinity DataIC50:  4.20E+4nM. Assay description: Inhibition of PI3Kbeta (unknown origin)
Ligand InfoPC cidPC sid
In DepthDetails PubMed
LigandPNGBDBM50599594(CHEMBL5171272)
Affinity DataIC50:  4.40E+3nM. Assay description: Inhibition of PDK1 in human BT-474 cells assessed as reduction in AKT phosphorylation at T308 residue incubated for 2 hrs
Ligand InfoPC cidPC sid
In DepthDetails PubMed
LigandPNGBDBM50599594(CHEMBL5171272)
Affinity DataIC50:  1.60E+4nM. Assay description: Inhibition of PI3Kdelta (unknown origin)
Ligand InfoPC cidPC sid
In DepthDetails PubMed
TargetPhosphatidylinositol 4-kinase alpha(Homo sapiens (Human))
Astrazeneca
Curated by ChEMBL
LigandPNGBDBM50599594(CHEMBL5171272)
Affinity DataIC50:  1.30E+4nM. Assay description: Inhibition of PI4Kalpha (unknown origin)
Ligand InfoPC cidPC sid
In DepthDetails PubMed
TargetPhosphatidylinositol 4-kinase beta(Homo sapiens (Human))
Astrazeneca
Curated by ChEMBL
LigandPNGBDBM50599594(CHEMBL5171272)
Affinity DataIC50:  6.50E+3nM. Assay description: Inhibition of PI4Kbeta (unknown origin)
Ligand InfoPC cidPC sid
In DepthDetails PubMed
TargetPlatelet-derived growth factor receptor beta(Homo sapiens (Human))
Astrazeneca
Curated by ChEMBL
LigandPNGBDBM50599594(CHEMBL5171272)
Affinity DataIC50:  5.90E+3nM. Assay description: Inhibition of PDGFRbeta (unknown origin)
Ligand InfoPC cidPC sid
In DepthDetails PubMed
LigandPNGBDBM50599594(CHEMBL5171272)
Affinity DataIC50:  2.20E+4nM. Assay description: Inhibition of PI3Kgamma (unknown origin)
Ligand InfoPC cidPC sid
In DepthDetails PubMed