BDBM50600871 CHEMBL5201759
SMILES Oc1ccc(CCCCCCCCNC(=O)[C@@H]2CN(C[C@H]2C(=O)N[C@H]2C[C@@H]2c2ccccc2)C(=O)c2ccc(cc2)C(=O)N2C[C@H]([C@@H](C2)C(=O)N[C@H]2C[C@@H]2c2ccccc2)C(=O)N[C@H]2C[C@@H]2c2ccccc2)cc1
InChI Key InChIKey=CUEIHNLADNVNAM-HKTXSPCFSA-N
Data  2 EC50
  Tab Delimited (TSV)   2D SDfile   Computed 3D by Vconf -m prep SDfile
Find this compound or compounds like it in BindingDB:
Activity Spreadsheet -- Enzyme Inhibition Constant Data from BindingDB
Found 2 hits for monomerid = 50600871
TargetToll-like receptor 2(Mus musculus)
The Scripps Research Institute
Curated by ChEMBL
LigandPNGBDBM50600871(CHEMBL5201759)
Affinity DataEC50:  2.60nM. Assay description: Agonist activity at TLR1/TLR2 in wild type C57BL/6J mouse macrophages assessed as stimulation of TNF alpha release measured for 4 hrs by ELISA based ...
Ligand InfoPC cidPC sid
In DepthDetails PubMed
TargetToll-like receptor 1(Homo sapiens)
The Scripps Research Institute
Curated by ChEMBL
LigandPNGBDBM50600871(CHEMBL5201759)
Affinity DataEC50:  0.150nM. Assay description: Agonist activity at TLR1/TLR2 in human THP-1 derived macrophages assessed as stimulation of TNF alpha release measured for 4 hrs by ELISA based assay
Ligand InfoPC cidPC sid
In DepthDetails PubMed