BDBM50600938 CHEMBL5192641
SMILES CCCCCCCCCCCCCCNC(=O)[C@@H]1CN(C[C@H]1C(=O)N[C@H]1C[C@@H]1c1ccccc1)C(=O)c1ccc(cc1)C(=O)N1C[C@H]([C@@H](C1)C(=O)N[C@H]1C[C@@H]1c1ccccc1)C(=O)N[C@H]1C[C@@H]1c1ccccc1
InChI Key InChIKey=XLTFUCZYBMEULX-HKTXSPCFSA-N
Data  2 EC50
  Tab Delimited (TSV)   2D SDfile   Computed 3D by Vconf -m prep SDfile
Find this compound or compounds like it in BindingDB:
Activity Spreadsheet -- Enzyme Inhibition Constant Data from BindingDB
Found 2 hits for monomerid = 50600938
TargetToll-like receptor 2(Mus musculus)
The Scripps Research Institute
Curated by ChEMBL
LigandPNGBDBM50600938(CHEMBL5192641)
Affinity DataEC50:  1.10nM. Assay description: Agonist activity at TLR1/TLR2 in wild type C57BL/6J mouse macrophages assessed as stimulation of TNF alpha release measured for 4 hrs by ELISA based ...
Ligand InfoPC cidPC sid
In DepthDetails PubMed
TargetToll-like receptor 1(Homo sapiens)
The Scripps Research Institute
Curated by ChEMBL
LigandPNGBDBM50600938(CHEMBL5192641)
Affinity DataEC50:  0.100nM. Assay description: Agonist activity at TLR1/TLR2 in human THP-1 derived macrophages assessed as stimulation of TNF alpha release measured for 4 hrs by ELISA based assay
Ligand InfoPC cidPC sid
In DepthDetails PubMed