BDBM50601248 CHEMBL5186705
SMILES CCCCCCCCCCCCCCCC(=O)N[C@@H](CCC(=O)N[C@@H](CCC(=O)NCCCC[C@H](NC(=O)[C@H](CC(O)=O)NC(=O)[C@H](CO)NC(=O)[C@@H](NC(=O)[C@H](Cc1ccccc1)NC(=O)[C@@H](NC(=O)CNC(=O)[C@H](CCC(N)=O)NC(=O)[C@@H](CO)NC(=O)[C@@H](N)Cc1c[nH]cn1)[C@@H](C)O)[C@@H](C)O)C(=O)N[C@@H](CO)C(=O)N[C@@H](CCCCN)C(=O)N[C@@H](Cc1ccc(O)cc1)C(=O)N[C@@H](CC(C)C)C(=O)N[C@@H](CC(O)=O)C(=O)N[C@@H](CCC(O)=O)C(=O)N[C@@H](CCCNC(N)=N)C(=O)N[C@@H](C)C(=O)N[C@@H](C)C(=O)N[C@@H](CCC(N)=O)C(=O)N[C@@H](CCCCN=[N+]=[N-])C(=O)N[C@@H](Cc1ccccc1)C(=O)N[C@@H](C(C)C)C(=O)N[C@@H](CCC(N)=O)C(=O)N[C@@H](Cc1c[nH]c2ccccc12)C(=O)N[C@@H](CC(C)C)C(=O)N[C@@H](CC(C)C)C(=O)N[C@@H](CC(O)=O)C(=O)N[C@@H]([C@@H](C)O)C(N)=O)C(O)=O)C(O)=O
InChI Key InChIKey=JTKSWMFFJBQWFS-TYRONVCZSA-N
Data  2 EC50
  Tab Delimited (TSV)   2D SDfile   Computed 3D by Vconf -m prep SDfile
Find this compound or compounds like it in BindingDB:
Activity Spreadsheet -- Enzyme Inhibition Constant Data from BindingDB
Found 2 hits for monomerid = 50601248
TargetGlucagon-like peptide 1 receptor(Homo sapiens (Human))
Merck
Curated by ChEMBL
LigandPNGBDBM50601248(CHEMBL5186705)
Affinity DataEC50:  0.0280nM. Assay description: Agonist activity at human GLP1R expressed in frozen cells assessed as measuring the cAMP level incubated for 1 hr by by HitHunter chemiluminescence b...
Ligand InfoPC cidPC sid
In DepthDetails PubMed
TargetGlucagon receptor(Homo sapiens (Human))
Merck
Curated by ChEMBL
LigandPNGBDBM50601248(CHEMBL5186705)
Affinity DataEC50:  0.0130nM. Assay description: Agonist activity at human GCGR expressed in frozen cells assessed as measuring the cAMP level incubated for 1 hr by by HitHunter chemiluminescence ba...
Ligand InfoPC cidPC sid
In DepthDetails PubMed