BDBM50601513 CHEMBL5180351
SMILES COC(=O)Nc1c(C)cc(cc1C)N(CC#C)Cc1ccc(F)cc1
InChI Key InChIKey=HXUBJZRAVCPBRH-UHFFFAOYSA-N
Data  11 IC50  2 EC50
PDB links: 3 PDB IDs match this monomer.
  Tab Delimited (TSV)   2D SDfile   Computed 3D by Vconf -m prep SDfile
Find this compound or compounds like it in BindingDB:
Activity Spreadsheet -- Enzyme Inhibition Constant Data from BindingDB
Found 13 hits for monomerid = 50601513
TargetCytochrome P450 2C9(Homo sapiens (Human))
Shanghai Institute Of Materia Medica
Curated by ChEMBL
LigandPNGBDBM50601513(CHEMBL5180351)
Affinity DataIC50: >5.00E+4nM. Assay description: Time dependent inhibition of human liver microsome CYP2C9 preincubated for 0.5 hrs in presence or absence of NADPH followed by substrate addition by ...
In DepthDetails PubMed
TargetCytochrome P450 2C19(Homo sapiens (Human))
Shanghai Institute Of Materia Medica
Curated by ChEMBL
LigandPNGBDBM50601513(CHEMBL5180351)
Affinity DataIC50: >5.00E+4nM. Assay description: Time dependent inhibition of human liver microsome CYP2C19 preincubated for 0.5 hrs in presence or absence of NADPH followed by substrate addition by...
In DepthDetails PubMed
TargetCytochrome P450 2D6(Homo sapiens (Human))
Shanghai Institute Of Materia Medica
Curated by ChEMBL
LigandPNGBDBM50601513(CHEMBL5180351)
Affinity DataIC50: >5.00E+4nM. Assay description: Time dependent inhibition of human liver microsome CYP2D6 preincubated for 0.5 hrs in presence or absence of NADPH followed by substrate addition by ...
In DepthDetails PubMed
TargetCytochrome P450 3A4(Homo sapiens (Human))
Shanghai Institute Of Materia Medica
Curated by ChEMBL
LigandPNGBDBM50601513(CHEMBL5180351)
Affinity DataIC50: >5.00E+4nM. Assay description: Time dependent inhibition of human liver microsome CYP3A4 preincubated for 0.5 hrs in presence or absence of NADPH followed by midazolam addition by ...
In DepthDetails PubMed
TargetCytochrome P450 3A4(Homo sapiens (Human))
Shanghai Institute Of Materia Medica
Curated by ChEMBL
LigandPNGBDBM50601513(CHEMBL5180351)
Affinity DataIC50: >5.00E+4nM. Assay description: Time dependent inhibition of human liver microsome CYP3A4 preincubated for 0.5 hrs in presence or absence of NADPH followed by testosterone addition ...
In DepthDetails PubMed
TargetCytochrome P450 1A2(Homo sapiens (Human))
Shanghai Institute Of Materia Medica
Curated by ChEMBL
LigandPNGBDBM50601513(CHEMBL5180351)
Affinity DataIC50:  2.53E+3nM. Assay description: Time dependent inhibition of human liver microsome CYP1A2 preincubated for 0.5 hrs in presence of NADPH followed by substrate addition by LC-MS/MS me...
In DepthDetails PubMed
TargetPotassium voltage-gated channel subfamily KQT member 3(Rattus norvegicus)
Shanghai Institute Of Materia Medica
Curated by ChEMBL
LigandPNGBDBM50601513(CHEMBL5180351)
Affinity DataEC50:  33nM. Assay description: Agonist activity at rat KCNQ2/3 channel expressed in CHO cells by patch clamp method
In DepthDetails PubMed
TargetCytochrome P450 2B6(Homo sapiens (Human))
Shanghai Institute Of Materia Medica
Curated by ChEMBL
LigandPNGBDBM50601513(CHEMBL5180351)
Affinity DataIC50:  5.76E+3nM. Assay description: Time dependent inhibition of human liver microsome CYP2B6 preincubated for 0.5 hrs in presence of NADPH followed by substrate addition by LC-MS/MS me...
In DepthDetails PubMed
TargetCytochrome P450 2B6(Homo sapiens (Human))
Shanghai Institute Of Materia Medica
Curated by ChEMBL
LigandPNGBDBM50601513(CHEMBL5180351)
Affinity DataIC50:  1.41E+5nM. Assay description: Time dependent inhibition of human liver microsome CYP2B6 preincubated for 0.5 hrs in absence of NADPH followed by substrate addition by LC-MS/MS met...
In DepthDetails PubMed
TargetCytochrome P450 2C8(Homo sapiens (Human))
Shanghai Institute Of Materia Medica
Curated by ChEMBL
LigandPNGBDBM50601513(CHEMBL5180351)
Affinity DataIC50:  3.52E+4nM. Assay description: Time dependent inhibition of human liver microsome CYP2C8 preincubated for 0.5 hrs in presence of NADPH followed by substrate addition by LC-MS/MS me...
In DepthDetails PubMed
TargetCytochrome P450 2C8(Homo sapiens (Human))
Shanghai Institute Of Materia Medica
Curated by ChEMBL
LigandPNGBDBM50601513(CHEMBL5180351)
Affinity DataIC50:  2.25E+5nM. Assay description: Time dependent inhibition of human liver microsome CYP2C8 preincubated for 0.5 hrs in absence of NADPH followed by substrate addition by LC-MS/MS met...
In DepthDetails PubMed
TargetPotassium voltage-gated channel subfamily KQT member 2(Rattus norvegicus)
Shanghai Institute Of Materia Medica
Curated by ChEMBL
LigandPNGBDBM50601513(CHEMBL5180351)
Affinity DataEC50:  37nM. Assay description: Agonist activity at rat KCNQ2 channel expressed in CHO cells by patch clamp method
TargetCytochrome P450 1A2(Homo sapiens (Human))
Shanghai Institute Of Materia Medica
Curated by ChEMBL
LigandPNGBDBM50601513(CHEMBL5180351)
Affinity DataIC50:  1.42E+5nM. Assay description: Time dependent inhibition of human liver microsome CYP1A2 preincubated for 0.5 hrs in absence of NADPH followed by substrate addition by LC-MS/MS met...
In DepthDetails PubMed