BDBM50603092 CHEMBL5190509
SMILES CCNC(=O)c1ccc2N([C@@H](C)C[C@@H](Nc3ccc(cn3)C#N)c2c1)C(C)=O
InChI Key InChIKey=FQIILLCMQDMGGP-SCLBCKFNSA-N
Data  5 IC50
  Tab Delimited (TSV)   2D SDfile   Computed 3D by Vconf -m prep SDfile
Find this compound or compounds like it in BindingDB:
Activity Spreadsheet -- Enzyme Inhibition Constant Data from BindingDB
Found 5 hits for monomerid = 50603092
TargetBromodomain-containing protein 4(Homo sapiens (Human))
Glaxosmithkline R&D
Curated by ChEMBL
LigandPNGBDBM50603092(CHEMBL5190509)
Affinity DataIC50:  200nM. Assay description: Inhibition of BRD4 BD1 (unknown origin) incubated for 30 mins in presence of fluorescent ligand by TR-FRET method
Ligand InfoPC cidPC sid
In DepthDetails PubMed
TargetBromodomain-containing protein 4(Homo sapiens (Human))
Glaxosmithkline R&D
Curated by ChEMBL
LigandPNGBDBM50603092(CHEMBL5190509)
Affinity DataIC50:  100nM. Assay description: Inhibition of BRD4 BD2 (unknown origin) incubated for 30 mins in presence of fluorescent ligand by TR-FRET method
Ligand InfoPC cidPC sid
In DepthDetails PubMed
TargetPotassium voltage-gated channel subfamily H member 2(Homo sapiens (Human))
Glaxosmithkline R&D
Curated by ChEMBL
LigandPNGBDBM50603092(CHEMBL5190509)
Affinity DataIC50: <5.01E+4nM. Assay description: Inhibition of hERG
Ligand InfoPC cidPC sid
In DepthDetails PubMed
TargetCytochrome P450 3A4(Homo sapiens (Human))
Glaxosmithkline R&D
Curated by ChEMBL
LigandPNGBDBM50603092(CHEMBL5190509)
Affinity DataIC50: <3.98E+4nM. Assay description: Inhibition of CYP3A4 (unknown origin)
Ligand InfoPC cidPC sid
In DepthDetails PubMed
TargetC-C motif chemokine 2(Homo sapiens (Human))
Glaxosmithkline R&D
Curated by ChEMBL
LigandPNGBDBM50603092(CHEMBL5190509)
Affinity DataIC50:  251nM. Assay description: Inhibition of MCP-1 in LPS-stimulated human whole blood incubate for 24 hrs by immuno assay
Ligand InfoPC cidPC sid
In DepthDetails PubMed