BDBM50603793 CHEMBL5199542
SMILES COC1=CC(=O)N(C1Cc1ccc(cc1)-c1ccc(OC)cc1)C(=O)\C=C\[C@H](CCc1ccccc1)NC(=O)[C@H](CC(C)C)NC(=O)[C@H](CC(C)C)NC(=O)C1CCN(C)CC1
InChI Key InChIKey=YKSZHRNCWHWDGN-USHAHLKOSA-N
Data  1 IC50
  Tab Delimited (TSV)   2D SDfile   Computed 3D by Vconf -m prep SDfile
Find this compound or compounds like it in BindingDB:
Activity Spreadsheet -- Enzyme Inhibition Constant Data from BindingDB
Found 1 hit for monomerid = 50603793
TargetCruzipain(Trypanosoma cruzi)
University Of California San Diego
Curated by ChEMBL
LigandPNGBDBM50603793(CHEMBL5199542)
Affinity DataIC50:  0.260nM. Assay description: Inhibition of Trypanosoma cruzi cruzain using Z-FR-AMC as substrate preincubated for 10 mins followed by substrate addition by fluorimetric analysis
Ligand InfoPC cidPC sid
In DepthDetails PubMed