BDBM50607509 CHEMBL5219789
SMILES CN[C@@H]1COc2c(cnn2C1)S(=O)(=O)NC(=O)Nc1c2CCCc2cc2CCCc12
InChI Key InChIKey=NDRARVKETDZHBS-AWEZNQCLSA-N
Data  14 IC50
PDB links: 1 PDB ID matches this monomer.
  Tab Delimited (TSV)   2D SDfile   Computed 3D by Vconf -m prep SDfile
Find this compound or compounds like it in BindingDB:
Activity Spreadsheet -- Enzyme Inhibition Constant Data from BindingDB
Found 14 hits for monomerid = 50607509
TargetNACHT, LRR and PYD domains-containing protein 3(Homo sapiens (Human))
Jecure Therapeutics
Curated by ChEMBL
LigandPNGBDBM50607509(CHEMBL5219789)
Affinity DataIC50:  5.40nM. Assay description: Inhibition of NLRP3 inflammasome activation in LPS and nigericin-stimulated human PBMC cells assessed as reduction in IL-1beta release preincubated w...
TargetNACHT, LRR and PYD domains-containing protein 3(Homo sapiens (Human))
Jecure Therapeutics
Curated by ChEMBL
LigandPNGBDBM50607509(CHEMBL5219789)
Affinity DataIC50:  400nM. Assay description: Inhibition of NLRP3 inflammasome activation in LPS and ATP-stimulated human whole blood assessed as reduction in IL-1beta release in plasma preincuba...
TargetNLR family CARD domain-containing protein 4(Homo sapiens)
Jecure Therapeutics
Curated by ChEMBL
LigandPNGBDBM50607509(CHEMBL5219789)
Affinity DataIC50: >2.00E+4nM. Assay description: Inhibition of NLRC4 inflammasome activation in LPS/flagellin-treated human THP-1 cells preincubated with LPS for 3 hrs followed by compound addition ...
In DepthDetails PubMed
TargetNACHT, LRR and PYD domains-containing protein 3(Homo sapiens (Human))
Jecure Therapeutics
Curated by ChEMBL
LigandPNGBDBM50607509(CHEMBL5219789)
Affinity DataIC50:  51nM. Assay description: Inhibition of NLRP3 induced caspase 1 activity in LPS/nigericin-treated human THP-1 cells preincubated with LPS for 3 hrs followed by compound additi...
TargetNACHT, LRR and PYD domains-containing protein 3(Mus musculus)
Jecure Therapeutics
Curated by ChEMBL
LigandPNGBDBM50607509(CHEMBL5219789)
Affinity DataIC50:  63nM. Assay description: Inhibition of NLRP3 induced IL-1beta release in LPS/nigericin-treated mouse BMDM cells preincubated with LPS for 3 hrs followed by compound addition ...
In DepthDetails PubMed
TargetNACHT, LRR and PYD domains-containing protein 3(Homo sapiens (Human))
Jecure Therapeutics
Curated by ChEMBL
LigandPNGBDBM50607509(CHEMBL5219789)
Affinity DataIC50:  48nM. Assay description: Inhibition of NLRP3 inflammasome activation in LPS/nigericin stimulated human THP1-ASC-GFP cells assessed as decrease in ASC speck formation preincub...
TargetNACHT, LRR and PYD domains-containing protein 3(Homo sapiens (Human))
Jecure Therapeutics
Curated by ChEMBL
LigandPNGBDBM50607509(CHEMBL5219789)
Affinity DataIC50:  17nM. Assay description: Inhibition of NLRP3 inflammasome activation in LPS-stimulated human monocyte-derived macrophage assessed as reduction in IL-18 secretion in presence ...
TargetNACHT, LRR and PYD domains-containing protein 3(Mus musculus)
Jecure Therapeutics
Curated by ChEMBL
LigandPNGBDBM50607509(CHEMBL5219789)
Affinity DataIC50:  100nM. Assay description: Inhibition of NLRP3 inflammasome activation in LPS and ATP-stimulated mouse whole blood assessed as reduction in IL-1beta release preincubated for 3 ...
In DepthDetails PubMed
TargetNACHT, LRR and PYD domains-containing protein 3(Homo sapiens (Human))
Jecure Therapeutics
Curated by ChEMBL
LigandPNGBDBM50607509(CHEMBL5219789)
Affinity DataIC50:  380nM. Assay description: Inhibition of NLRP3 inflammasome activation in LPS-stimulated human whole blood assessed as reduction in ILbeta secretion in presence of monosodium u...
TargetNACHT, LRR and PYD domains-containing protein 3(Homo sapiens (Human))
Jecure Therapeutics
Curated by ChEMBL
LigandPNGBDBM50607509(CHEMBL5219789)
Affinity DataIC50:  490nM. Assay description: Inhibition of NLRP3 inflammasome activation in LPS-stimulated human whole blood assessed as reduction in ILbeta secretion in presence of cholesterol ...
TargetNACHT, LRR and PYD domains-containing protein 3(Homo sapiens (Human))
Jecure Therapeutics
Curated by ChEMBL
LigandPNGBDBM50607509(CHEMBL5219789)
Affinity DataIC50:  290nM. Assay description: Inhibition of NLRP3 inflammasome activation in LPS-stimulated human whole blood assessed as reduction in ILbeta secretion in presence of calcium pyro...
TargetNACHT, LRR and PYD domains-containing protein 3(Homo sapiens (Human))
Jecure Therapeutics
Curated by ChEMBL
LigandPNGBDBM50607509(CHEMBL5219789)
Affinity DataIC50:  17nM. Assay description: Inhibition of NLRP3 inflammasome activation in LPS-stimulated human monocyte-derived macrophage assessed as reduction in ILbeta secretion in presence...
TargetNACHT, LRR and PYD domains-containing protein 3(Homo sapiens (Human))
Jecure Therapeutics
Curated by ChEMBL
LigandPNGBDBM50607509(CHEMBL5219789)
Affinity DataIC50:  17nM. Assay description: Inhibition of NLRP3 inflammasome activation in LPS-stimulated human monocyte-derived macrophage assessed as reduction in IL-18 secretion in presence ...
TargetNACHT, LRR and PYD domains-containing protein 3(Homo sapiens (Human))
Jecure Therapeutics
Curated by ChEMBL
LigandPNGBDBM50607509(CHEMBL5219789)
Affinity DataIC50:  16nM. Assay description: Inhibition of NLRP3 inflammasome activation in LPS-stimulated human monocyte-derived macrophage assessed as reduction in ILbeta secretion in presence...