BDBM50607592 CHEMBL5219466
SMILES COc1ccc(NC(=O)[C@H]2CCCN2C(=O)C2(CCCC2)c2cccc(Cl)c2)nc1
InChI Key InChIKey=DPMSTWVFLDSJGR-LJQANCHMSA-N
Data  1 IC50  1 EC50
  Tab Delimited (TSV)   2D SDfile   Computed 3D by Vconf -m prep SDfile
Find this compound or compounds like it in BindingDB:
Activity Spreadsheet -- Enzyme Inhibition Constant Data from BindingDB
Found 2 hits for monomerid = 50607592
TargetCREB-binding protein/Histone acetyltransferase p300(Homo sapiens (Human))
Glaxosmithkline
Curated by ChEMBL
LigandPNGBDBM50607592(CHEMBL5219466)
Affinity DataEC50:  501nM. Assay description: Inhibition of CBP/p300 in human COLO 320HSR cells assessed as reduction of C-myc levels measured after 24 hrs by HTRF assay
Ligand InfoPC cidPC sid
In DepthDetails PubMed
TargetHistone acetyltransferase p300(Homo sapiens (Human))
Glaxosmithkline
Curated by ChEMBL
LigandPNGBDBM50607592(CHEMBL5219466)
Affinity DataIC50:  2nM. Assay description: Inhibition of full-length P300 (unknown origin) using ARTKQTARKSTGGKAPRKQLAGG-K(Biotin)-amide as substrate preincubated for 60 mins followed by subst...
Ligand InfoPC cidPC sid
In DepthDetails PubMed