BDBM50607597 CHEMBL5219157
SMILES Fc1ccc(cc1)C1(CCC1)C(=O)N1CCC[C@@H]1C(=O)Nc1ccc2[nH]ncc2n1
InChI Key InChIKey=ZLSIJSSCBSRUNF-GOSISDBHSA-N
Data  1 IC50  1 EC50
  Tab Delimited (TSV)   2D SDfile   Computed 3D by Vconf -m prep SDfile
Find this compound or compounds like it in BindingDB:
Activity Spreadsheet -- Enzyme Inhibition Constant Data from BindingDB
Found 2 hits for monomerid = 50607597
TargetCREB-binding protein/Histone acetyltransferase p300(Homo sapiens (Human))
Glaxosmithkline
Curated by ChEMBL
LigandPNGBDBM50607597(CHEMBL5219157)
Affinity DataEC50:  100nM. Assay description: Inhibition of CBP/p300 in human COLO 320HSR cells assessed as reduction of C-myc levels measured after 24 hrs by HTRF assay
Ligand InfoPC cidPC sid
In DepthDetails PubMed
TargetHistone acetyltransferase p300(Homo sapiens (Human))
Glaxosmithkline
Curated by ChEMBL
LigandPNGBDBM50607597(CHEMBL5219157)
Affinity DataIC50:  0.126nM. Assay description: Inhibition of full-length P300 (unknown origin) using ARTKQTARKSTGGKAPRKQLAGG-K(Biotin)-amide as substrate preincubated for 60 mins followed by subst...
Ligand InfoPC cidPC sid
In DepthDetails PubMed