BDBM50607646 CHEMBL5220355::US11718589, Compound 83b
SMILES O=C(N1CCCCC1)c1ccc2ncc(nc2c1)-c1ccc2[nH]c(=O)ccc2c1
InChI Key InChIKey=DXRKWWKXZPCXTL-UHFFFAOYSA-N
Data  2 IC50
  Tab Delimited (TSV)   2D SDfile   Computed 3D by Vconf -m prep SDfile
Find this compound or compounds like it in BindingDB:
Activity Spreadsheet -- Enzyme Inhibition Constant Data from BindingDB
Found 2 hits for monomerid = 50607646
Target15-hydroxyprostaglandin dehydrogenase [NAD(+)](Homo sapiens (Human))
Ut Southwestern Medical Center
Curated by ChEMBL
LigandPNGBDBM50607646(CHEMBL5220355 | US11718589, Compound 83b)
Affinity DataIC50:  2.30nM. Assay description: Inhibition of 15-PGDH (unknown origin) using NAD as substrate measured for 3.5 mins
Ligand InfoPC cidPC sid
In DepthDetails PubMed
Target15-hydroxyprostaglandin dehydrogenase [NAD(+)](Homo sapiens (Human))
Ut Southwestern Medical Center
Curated by ChEMBL
LigandPNGBDBM50607646(CHEMBL5220355 | US11718589, Compound 83b)
Affinity DataIC50:  2.30nM. Assay description: This Example provides data on two groups (Table 1 and Table 2) of structural analogues of identified 15-PGDH inhibitors. Data provided is the IC50 of...
Ligand InfoPC cidPC sid
In DepthDetails US Patent