BDBM50607739 CHEMBL5221111
SMILES C[C@@H]1c2ccccc2C=CN(C)C1=O
InChI Key InChIKey=YSRQSFSJQWPTEK-SECBINFHSA-N
Data  3 IC50
  Tab Delimited (TSV)   2D SDfile   Computed 3D by Vconf -m prep SDfile
Find this compound or compounds like it in BindingDB:
Activity Spreadsheet -- Enzyme Inhibition Constant Data from BindingDB
Found 3 hits for monomerid = 50607739
TargetBromodomain-containing protein 4(Homo sapiens (Human))
Gsk
Curated by ChEMBL
LigandPNGBDBM50607739(CHEMBL5221111)
Affinity DataIC50:  5.01E+3nM. Assay description: Inhibition of BRD4 BD2 (unknown origin) measured by TR-FRET assay
Ligand InfoPC cidPC sid
In DepthDetails PubMed
TargetC-C motif chemokine 2(Homo sapiens (Human))
Gsk
Curated by ChEMBL
LigandPNGBDBM50607739(CHEMBL5221111)
Affinity DataIC50:  5.01E+3nM. Assay description: Inhibition of MCP-1 in LPS-stimulated human whole blood incubate for 24 hrs by immuno assay
Ligand InfoPC cidPC sid
In DepthDetails PubMed
TargetBromodomain-containing protein 4(Homo sapiens (Human))
Gsk
Curated by ChEMBL
LigandPNGBDBM50607739(CHEMBL5221111)
Affinity DataIC50:  1.59E+3nM. Assay description: Inhibition of BRD4 BD1 (unknown origin) measured by TR-FRET assay
Ligand InfoPC cidPC sid
In DepthDetails PubMed