BDBM510175 N-(2-chloro-3-(trifluoromethyl)benzyl)- 5-fluoro-8-hydroxy-8-(hydroxymethyl)- 5,6,7,8-tetrahydroquinoline-5- carboxamide::US11077100, Example 35::US11439633, Example 35
SMILES OCC1(O)CCC(F)(C(=O)NCc2cccc(c2Cl)C(F)(F)F)c2cccnc12
InChI Key InChIKey=UVRPFRWRXGSVSY-UHFFFAOYSA-N
Data  2 IC50
  Tab Delimited (TSV)   2D SDfile   Computed 3D by Vconf -m prep SDfile
Find this compound or compounds like it in BindingDB:
Activity Spreadsheet -- Enzyme Inhibition Constant Data from BindingDB
Found 2 hits for monomerid = 510175
TargetP2X purinoceptor 7(Homo sapiens (Human))
Raqualia Pharma
US Patent
LigandPNGBDBM510175(N-(2-chloro-3-(trifluoromethyl)benzyl)- 5-fluoro-8...)
Affinity DataIC50: <50nM. Assay description: The functional activity of compounds was determined by measuring changes in intracellular calcium concentration using a Ca2+-sensitive fluorescent dy...
Ligand InfoPC cidPC sid
In DepthDetails US Patent
TargetP2X purinoceptor 7(Homo sapiens (Human))
Raqualia Pharma
US Patent
LigandPNGBDBM510175(N-(2-chloro-3-(trifluoromethyl)benzyl)- 5-fluoro-8...)
Affinity DataIC50: <50nM. Assay description: 1. Wash each well with 80 microL of assay buffer (20 mM HEPES, 1×HBSS, pH 7.4 adjusted with NaOH) three times and leave 20 microL using plate washer,...
Ligand InfoPC cidPC sid
In DepthDetails US Patent