BDBM511524 US11059794, Example 4.00
SMILES Cc1nnn(Cc2cc(ccc2CCC(=O)N2CCN(CC2)C(=O)c2c(F)cc(cc2F)S(N)(=O)=O)C(F)(F)F)n1
InChI Key InChIKey=PKAFZJIZJFKXPG-UHFFFAOYSA-N
Data  2 IC50
  Tab Delimited (TSV)   2D SDfile   Computed 3D by Vconf -m prep SDfile
Find this compound or compounds like it in BindingDB:
Activity Spreadsheet -- Enzyme Inhibition Constant Data from BindingDB
Found 2 hits for monomerid = 511524
TargetCarbonic anhydrase 2(Homo sapiens (Human))
Hoffmann-La Roche
US Patent
LigandPNGBDBM511524(US11059794, Example 4.00)
Affinity DataIC50:  17.6nM. Assay description: Human carbonic anhydrase II (hCA-II) inhibition was measured by an absorbance method using 4-nitrophenyl acetate (4-NPA) as its substrate. 4-NPA can ...
Ligand InfoPC cidPC sid
In DepthDetails US Patent
TargetAtaxin-1(Homo sapiens (Human))
Hoffmann-La Roche
US Patent
LigandPNGBDBM511524(US11059794, Example 4.00)
Affinity DataIC50:  1nM. Assay description: ATX inhibition was measured by a fluorescence quenching assay using a specifically labeled substrate analogue (MR121 substrate). To obtain this MR121...
Ligand InfoPC cidPC sid
In DepthDetails US Patent