BDBM513649 8-(1,3-dimethyl-1H-pyrazol-5-yl)-5-(((5-fluoro-2,3-dihydrobenzofuran-4-yl)methyl)amino)imidazo[1,2-c]pyrimidine-2-carboxamide::US11091495, Example 11::US11485738, Example 11
SMILES Cc1cc(-c2cnc(NCc3c4CCOc4ccc3F)n3cc(nc23)C(N)=O)n(C)n1
InChI Key InChIKey=SQUISAAFYLZEJH-UHFFFAOYSA-N
Data  2 IC50
  Tab Delimited (TSV)   2D SDfile   Computed 3D by Vconf -m prep SDfile
Find this compound or compounds like it in BindingDB:
Activity Spreadsheet -- Enzyme Inhibition Constant Data from BindingDB
Found 2 hits for monomerid = 513649
LigandPNGBDBM513649(8-(1,3-dimethyl-1H-pyrazol-5-yl)-5-(((5-fluoro-2,3...)
Affinity DataIC50: <100nM. Assay description: An aliquot of each serial dilution of test compound was added to deep 384 well plate using Acoustic Technology instrument (Echo 550, LabCyte) contain...
Ligand InfoPC cidPC sid
In DepthDetails US Patent
LigandPNGBDBM513649(8-(1,3-dimethyl-1H-pyrazol-5-yl)-5-(((5-fluoro-2,3...)
Affinity DataIC50: <100nM. Assay description: Briefly, compounds of the present invention were solubilized in DMSO and a series of 10, three-fold serial dilutions were made for each compound in 1...
Ligand InfoPC cidPC sid
In DepthDetails US Patent