BDBM513680 US11091495, Example 41::US11220509, Example 41::US11485738, Example 41
SMILES Cc1cc(cnn1)-c1cnc(NCc2c3CCOc3ccc2F)n2cc(nc12)C#N
InChI Key InChIKey=GFEAHOVOZGDKPN-UHFFFAOYSA-N
Data  4 IC50
  Tab Delimited (TSV)   2D SDfile   Computed 3D by Vconf -m prep SDfile
Find this compound or compounds like it in BindingDB:
Activity Spreadsheet -- Enzyme Inhibition Constant Data from BindingDB
Found 4 hits for monomerid = 513680
LigandPNGBDBM513680(US11091495, Example 41 | US11220509, Example 41 | ...)
Affinity DataIC50: <100nM. Assay description: Briefly, compounds of the present invention were solubilized in DMSO and a series of 10, three-fold serial dilutions were made for each compound in 1...
Ligand InfoPC cidPC sid
In DepthDetails US Patent
LigandPNGBDBM513680(US11091495, Example 41 | US11220509, Example 41 | ...)
Affinity DataIC50: <100nM. Assay description: Briefly, compounds of the present invention were solubilized in DMSO and a series of 10, three-fold serial dilutions were made for each compound in 1...
Ligand InfoPC cidPC sid
In DepthDetails US Patent
LigandPNGBDBM513680(US11091495, Example 41 | US11220509, Example 41 | ...)
Affinity DataIC50: <100nM. Assay description: Briefly, compounds of the present invention were solubilized in DMSO and a series of 10, three-fold serial dilutions were made for each compound in 1...
Ligand InfoPC cidPC sid
In DepthDetails US Patent
LigandPNGBDBM513680(US11091495, Example 41 | US11220509, Example 41 | ...)
Affinity DataIC50: <100nM. Assay description: An aliquot of each serial dilution of test compound was added to deep 384 well plate using Acoustic Technology instrument (Echo 550, LabCyte) contain...
Ligand InfoPC cidPC sid
In DepthDetails US Patent