BDBM513693 US11091495, Example 54::US11220509, Example 54::US11485738, Example 54
SMILES FC1CCN(Cc2ccc(cc2)-c2cnc(NCc3c4CCOc4ccc3F)n3cc(nc23)C#N)C1
InChI Key InChIKey=PSLHZKVMOWERSW-UHFFFAOYSA-N
Data  4 IC50
  Tab Delimited (TSV)   2D SDfile   Computed 3D by Vconf -m prep SDfile
Find this compound or compounds like it in BindingDB:
Activity Spreadsheet -- Enzyme Inhibition Constant Data from BindingDB
Found 4 hits for monomerid = 513693
LigandPNGBDBM513693(US11091495, Example 54 | US11220509, Example 54 | ...)
Affinity DataIC50: <100nM. Assay description: Briefly, compounds of the present invention were solubilized in DMSO and a series of 10, three-fold serial dilutions were made for each compound in 1...
Ligand InfoPC cidPC sid
In DepthDetails US Patent
LigandPNGBDBM513693(US11091495, Example 54 | US11220509, Example 54 | ...)
Affinity DataIC50: <100nM. Assay description: Briefly, compounds of the present invention were solubilized in DMSO and a series of 10, three-fold serial dilutions were made for each compound in 1...
Ligand InfoPC cidPC sid
In DepthDetails US Patent
LigandPNGBDBM513693(US11091495, Example 54 | US11220509, Example 54 | ...)
Affinity DataIC50: <100nM. Assay description: Briefly, compounds of the present invention were solubilized in DMSO and a series of 10, three-fold serial dilutions were made for each compound in 1...
Ligand InfoPC cidPC sid
In DepthDetails US Patent
LigandPNGBDBM513693(US11091495, Example 54 | US11220509, Example 54 | ...)
Affinity DataIC50: <100nM. Assay description: An aliquot of each serial dilution of test compound was added to deep 384 well plate using Acoustic Technology instrument (Echo 550, LabCyte) contain...
Ligand InfoPC cidPC sid
In DepthDetails US Patent