BDBM513707 US11091495, Example 68::US11220509, Example 68::US11485738, Example 68
SMILES Fc1ccc2OCCc2c1CNc1ncc(-c2cnccn2)c2nc(cn12)C#N
InChI Key InChIKey=UNEPUTDIPANHMW-UHFFFAOYSA-N
Data  5 IC50
  Tab Delimited (TSV)   2D SDfile   Computed 3D by Vconf -m prep SDfile
Find this compound or compounds like it in BindingDB:
Activity Spreadsheet -- Enzyme Inhibition Constant Data from BindingDB
Found 5 hits for monomerid = 513707
LigandPNGBDBM513707(US11091495, Example 68 | US11220509, Example 68 | ...)
Affinity DataIC50: <100nM. Assay description: Briefly, compounds of the present invention were solubilized in DMSO and a series of 10, three-fold serial dilutions were made for each compound in 1...
Ligand InfoPC cidPC sid
In DepthDetails US Patent
LigandPNGBDBM513707(US11091495, Example 68 | US11220509, Example 68 | ...)
Affinity DataIC50: <100nM. Assay description: An aliquot of each serial dilution of test compound was added to deep 384 well plate using Acoustic Technology instrument (Echo 550, LabCyte) contain...
Ligand InfoPC cidPC sid
In DepthDetails US Patent
LigandPNGBDBM513707(US11091495, Example 68 | US11220509, Example 68 | ...)
Affinity DataIC50: <100nM. Assay description: Briefly, compounds of the present invention were solubilized in DMSO and a series of 10, three-fold serial dilutions were made for each compound in 1...
Ligand InfoPC cidPC sid
In DepthDetails US Patent
LigandPNGBDBM513707(US11091495, Example 68 | US11220509, Example 68 | ...)
Affinity DataIC50: <100nM. Assay description: Briefly, compounds of the present invention were solubilized in DMSO and a series of 10, three-fold serial dilutions were made for each compound in 1...
Ligand InfoPC cidPC sid
In DepthDetails US Patent
LigandPNGBDBM513707(US11091495, Example 68 | US11220509, Example 68 | ...)
Affinity DataIC50:  300nM. Assay description: Briefly, compounds of the present invention were solubilized in DMSO and a series of 10, three-fold serial dilutions were made for each compound in 1...
Ligand InfoPC cidPC sid
In DepthDetails US Patent