BDBM51443 2-(3,4-dimethoxyphenyl)-N-(1H-1,2,4-triazol-5-yl)acetamide::2-(3,4-dimethoxyphenyl)-N-(1H-1,2,4-triazol-5-yl)ethanamide::MLS-0315829.0001::cid_3146342
SMILES COc1ccc(CC(=O)Nc2nnc[nH]2)cc1OC
InChI Key InChIKey=HJFGSCOTHWAZPN-UHFFFAOYSA-N
Data  1 EC50
  Tab Delimited (TSV)   2D SDfile   Computed 3D by Vconf -m prep SDfile
Find this compound or compounds like it in BindingDB:
Activity Spreadsheet -- Enzyme Inhibition Constant Data from BindingDB
Found 1 hit for monomerid = 51443
TargetAlkaline phosphatase, tissue-nonspecific isozyme(Homo sapiens (Human))
Burnham Center For Chemical Genomics
Curated by PubChem BioAssay
LigandPNGBDBM51443(2-(3,4-dimethoxyphenyl)-N-(1H-1,2,4-triazol-5-yl)a...)
Affinity DataEC50:  2.56E+4nM. Assay description: Data Source: Sanford-Burnham Center for Chemical Genomics (SBCCG) Source Affiliation: Sanford-Burnham Medical Research Institute (SBMRI, San Diego, C...
In DepthDetails PCBioAssay